detach-v
type: LexicalEntry
canonical form: detach
sense: 01301254-v
part of speech: verb

01301254-v
type: LexicalConcept
in scheme: en-word.net
definition: cause to become detached or separated; take off
example: detach the skin from the chicken before you eat it
ili: i28167
lexfile: verb.contact
part of speech: verb
hypernym: 01358741-v