affix-v
type: LexicalEntry
canonical form: affix
sense: 01300869-v
part of speech: verb

01300869-v
type: LexicalConcept
in scheme: en-word.net
definition: attach or become attached to a stem word
example: grammatical morphemes affix to the stem
ili: i28165
lexfile: verb.contact
part of speech: verb
hypernym: 01299048-v