implant-v
type: LexicalEntry
canonical form: implant
sense: 01293333-v
part of speech: verb

01293333-v
type: LexicalConcept
in scheme: en-word.net
definition: become attached to and embedded in the uterus
example: The egg fertilized in vitro implanted in the uterus of the birth mother with no further complications
ili: i28127
lexfile: verb.contact
part of speech: verb
hypernym: 01293025-v