gag-v
type: LexicalEntry
canonical form: gag
sense: 01287286-v
part of speech: verb

muzzle-v
type: LexicalEntry
canonical form: muzzle
sense: 01287286-v
part of speech: verb

01287286-v
type: LexicalConcept
in scheme: en-word.net
definition: tie a gag around someone's mouth in order to silence them
example: The burglars gagged the home owner and tied him to a chair
ili: i28091
lexfile: verb.contact
part of speech: verb
hypernym: 01288043-v