immaterial-a
type: LexicalEntry
canonical form: immaterial
sense: 01283686-s
part of speech: adjective

indifferent-a
type: LexicalEntry
canonical form: indifferent
sense: 01283686-s
part of speech: adjective

01283686-s
type: LexicalConcept
in scheme: en-word.net
definition: (often followed by ‘to’) lacking importance; not mattering one way or the other
example: whether you choose to do it or not is a matter that is quite immaterial (or indifferent)
example: what others think is altogether indifferent to him
ili: i6990
lexfile: adj.all
part of speech: adjective satellite
similar: https://en-word.net/synset/01283088-a