puncture-v
type: LexicalEntry
canonical form: puncture
sense: 01277535-v
part of speech: verb

01277535-v
type: LexicalConcept
in scheme: en-word.net
definition: pierce with a pointed object; make a hole into
example: puncture a tire
ili: i28037
lexfile: verb.contact
part of speech: verb
hypernym: 01443719-v