face-v
type: LexicalEntry
canonical form: face
sense: 01274500-v
part of speech: verb

01274500-v
type: LexicalConcept
in scheme: en-word.net
definition: line the edge (of a garment) with a different material
example: face the lapels of the jacket
ili: i28016
lexfile: verb.contact
part of speech: verb
hypernym: 01273348-v
similar: 01273753-v