pave-v
type: LexicalEntry
canonical form: pave
sense: 01269662-v
part of speech: verb

01269662-v
type: LexicalConcept
in scheme: en-word.net
definition: cover with a material such as stone or concrete to make suitable for vehicle traffic
example: pave the roads in the village
ili: i27987
lexfile: verb.contact
part of speech: verb
hypernym: 01266847-v