pare-v
type: LexicalEntry
canonical form: pare
sense: 01265128-v
part of speech: verb

trim-v
type: LexicalEntry
canonical form: trim
sense: 01265128-v
part of speech: verb

01265128-v
type: LexicalConcept
in scheme: en-word.net
definition: remove the edges from and cut down to the desired size
example: pare one's fingernails
example: trim the photograph
example: trim lumber
ili: i27962
lexfile: verb.contact
part of speech: verb
hypernym: 01555301-v