fixation-n
type: LexicalEntry
canonical form: fixation
sense: 01262862-n
part of speech: noun

01262862-n
type: LexicalConcept
in scheme: en-word.net
definition: the activity of fastening something firmly in position
ili: i42009
lexfile: noun.act
part of speech: noun
hypernym: 00148415-n