pink-v
type: LexicalEntry
canonical form: pink
sense: 01258072-v
part of speech: verb

01258072-v
type: LexicalConcept
in scheme: en-word.net
definition: cut in a zigzag pattern with pinking shears, in sewing
ili: i27920
lexfile: verb.contact
part of speech: verb
hypernym: 01555301-v