chafe-v
type: LexicalEntry
canonical form: chafe
sense: 01256372-v
part of speech: verb

excoriate-v
type: LexicalEntry
canonical form: excoriate
sense: 01256372-v
part of speech: verb

01256372-v
type: LexicalConcept
in scheme: en-word.net
definition: tear or wear off the skin or make sore by abrading
example: This leash chafes the dog's neck
ili: i27911
lexfile: verb.contact
part of speech: verb
hypernym: 01256577-v