puree-v
type: LexicalEntry
canonical form: puree
sense: 01253038-v
part of speech: verb

strain-v
type: LexicalEntry
canonical form: strain
sense: 01253038-v
part of speech: verb

01253038-v
type: LexicalConcept
in scheme: en-word.net
definition: rub through a strainer or process in an electric blender
example: puree the vegetables for the baby
ili: i27891
lexfile: verb.contact
part of speech: verb
domain topic: 00244785-n
hypernym: 01252288-v