bitter-a
type: LexicalEntry
canonical form: bitter
sense: 01248484-s
part of speech: adjective

01248484-s
type: LexicalConcept
in scheme: en-word.net
definition: proceeding from or exhibiting great hostility or animosity
example: a bitter struggle
example: bitter enemies
ili: i6815
lexfile: adj.all
part of speech: adjective satellite
similar: https://en-word.net/synset/01247284-a