dredge-v
type: LexicalEntry
canonical form: dredge
sense: 01247256-v
part of speech: verb

drag-v
type: LexicalEntry
canonical form: drag
sense: 01247256-v
part of speech: verb

01247256-v
type: LexicalConcept
in scheme: en-word.net
definition: search (as the bottom of a body of water) for something valuable or lost
ili: i27857
lexfile: verb.contact
part of speech: verb
hypernym: 01318273-v