strike-n
type: LexicalEntry
canonical form: strike
sense: 01246221-n
part of speech: noun

work stoppage-n
type: LexicalEntry
canonical form: work stoppage
sense: 01246221-n
part of speech: noun

01246221-n
type: LexicalConcept
in scheme: en-word.net
definition: a group's refusal to work in protest against low pay or bad work conditions
example: the strike lasted more than a month before it was settled
ili: i41910
lexfile: noun.act
part of speech: noun
hypernym: 01244711-n