vindication-n
type: LexicalEntry
canonical form: vindication
sense: 01243896-n
part of speech: noun

exoneration-n
type: LexicalEntry
canonical form: exoneration
sense: 01243896-n
part of speech: noun

01243896-n
type: LexicalConcept
in scheme: en-word.net
definition: the act of vindicating or defending against criticism or censure etc.
example: friends provided a vindication of his position
ili: i41898
lexfile: noun.act
part of speech: noun
hypernym: 01250194-n