daub-v
type: LexicalEntry
canonical form: daub
sense: 01235951-v
part of speech: verb

smear-v
type: LexicalEntry
canonical form: smear
sense: 01235951-v
part of speech: verb

01235951-v
type: LexicalConcept
in scheme: en-word.net
definition: cover (a surface) by smearing (a substance) over it
example: smear the wall with paint
example: daub the ceiling with plaster
ili: i27791
lexfile: verb.contact
part of speech: verb
hypernym: 01335412-v
similar: 01315909-v