invade-v
type: LexicalEntry
canonical form: invade
sense: 01230052-v
part of speech: verb

01230052-v
type: LexicalConcept
in scheme: en-word.net
definition: penetrate or assault, in a harmful or injurious way
example: The cancer had invaded her lungs
ili: i27761
lexfile: verb.contact
part of speech: verb
hypernym: 01229799-v