stroke-v
type: LexicalEntry
canonical form: stroke
sense: 01228534-v
part of speech: verb

01228534-v
type: LexicalConcept
in scheme: en-word.net
definition: touch lightly and repeatedly, as with brushing motions
example: He stroked his long beard
ili: i27754
lexfile: verb.contact
part of speech: verb
hypernym: 01208838-v