support-n
type: LexicalEntry
canonical form: support
sense: 01215009-n
part of speech: noun

01215009-n
type: LexicalConcept
in scheme: en-word.net
definition: aiding the cause or policy or interests of
example: the president no longer has the support of his own party
example: they developed a scheme of mutual support
ili: i41740
lexfile: noun.act
part of speech: noun
hypernym: 01210099-n