hit-v
type: LexicalEntry
canonical form: hit
sense: 01211755-v
part of speech: verb

strike-v
type: LexicalEntry
canonical form: strike
sense: 01211755-v
part of speech: verb

01211755-v
type: LexicalConcept
in scheme: en-word.net
definition: affect or afflict suddenly, usually adversely
example: We were hit by really bad weather
example: He was stricken with cancer when he was still a teenager
example: The earthquake struck at midnight
ili: i27668
lexfile: verb.contact
part of speech: verb
hypernym: 00137133-v
similar: 01126313-v