enlistment-n
type: LexicalEntry
canonical form: enlistment
sense: 01209476-n
part of speech: noun

01209476-n
type: LexicalConcept
in scheme: en-word.net
definition: the act of enlisting (as in a military service)
ili: i41709
lexfile: noun.act
part of speech: noun
hypernym: 01208643-n