sup-v
type: LexicalEntry
canonical form: sup
sense: 01208079-v
part of speech: verb

01208079-v
type: LexicalConcept
in scheme: en-word.net
definition: take solid or liquid food into the mouth a little at a time either by drinking or by eating with a spoon
ili: i27652
lexfile: verb.consumption
part of speech: verb
hypernym: 01159300-v