inhale-v
type: LexicalEntry
canonical form: inhale
sense: 01201417-v
part of speech: verb

01201417-v
type: LexicalConcept
in scheme: en-word.net
definition: draw deep into the lungs in by breathing
example: Clinton smoked marijuana but never inhaled
ili: i27615
lexfile: verb.consumption
part of speech: verb
hypernym: 01200739-v