weighty-a
type: LexicalEntry
canonical form: weighty
sense: 01193711-s
part of speech: adjective

01193711-s
type: LexicalConcept
in scheme: en-word.net
definition: weighing heavily on the spirit; causing anxiety or worry
example: weighty problems
ili: i6509
lexfile: adj.all
part of speech: adjective satellite
similar: https://en-word.net/synset/01192305-a