bankruptcy-n
type: LexicalEntry
canonical form: bankruptcy
sense: 01188887-n
part of speech: noun

01188887-n
type: LexicalConcept
in scheme: en-word.net
definition: a legal process intended to insure equality among the creditors of a corporation declared to be insolvent
ili: i41612
lexfile: noun.act
part of speech: noun
domain topic: 08458195-n
hypernym: 01187304-n