affirmation-n
type: LexicalEntry
canonical form: affirmation
sense: 01188682-n
part of speech: noun

01188682-n
type: LexicalConcept
in scheme: en-word.net
definition: a judgment by a higher court that the judgment of a lower court was correct and should stand
ili: i41611
lexfile: noun.act
part of speech: noun
domain topic: 08458195-n
hypernym: 01190300-n