reversal-n
type: LexicalEntry
canonical form: reversal
sense: 01188471-n
part of speech: noun

01188471-n
type: LexicalConcept
in scheme: en-word.net
definition: a judgment by a higher court that the judgment of a lower court was incorrect and should be set aside
ili: i41610
lexfile: noun.act
part of speech: noun
domain topic: 08458195-n
hypernym: 01190300-n