demonstration-n
type: LexicalEntry
canonical form: demonstration
sense: 01180193-n
part of speech: noun

manifestation-n
type: LexicalEntry
canonical form: manifestation
sense: 01180193-n
part of speech: noun

01180193-n
type: LexicalConcept
in scheme: en-word.net
definition: a public display of group feelings (usually of a political nature)
example: there were violent demonstrations against the war
ili: i41573
lexfile: noun.act
part of speech: noun
domain topic: 06157599-n
hypernym: 01179523-n