mumble-v
type: LexicalEntry
canonical form: mumble
sense: 01177521-v
part of speech: verb

gum-v
type: LexicalEntry
canonical form: gum
sense: 01177521-v
part of speech: verb

01177521-v
type: LexicalConcept
in scheme: en-word.net
definition: grind with the gums; chew without teeth and with great difficulty
example: the old man had no teeth left and mumbled his food
ili: i27494
lexfile: verb.consumption
part of speech: verb
hypernym: 01203727-v