obedience-n
type: LexicalEntry
canonical form: obedience
sense: 01169636-n
part of speech: noun

obeisance-n
type: LexicalEntry
canonical form: obeisance
sense: 01169636-n
part of speech: noun

01169636-n
type: LexicalConcept
in scheme: en-word.net
definition: the act of obeying; dutiful or submissive behavior with respect to another person
ili: i41515
lexfile: noun.act
part of speech: noun
hypernym: 01169416-n