submission-n
type: LexicalEntry
canonical form: submission
sense: 01169416-n
part of speech: noun

compliance-n
type: LexicalEntry
canonical form: compliance
sense: 01169416-n
part of speech: noun

01169416-n
type: LexicalConcept
in scheme: en-word.net
definition: the act of submitting; usually surrendering power to another
ili: i41514
lexfile: noun.act
part of speech: noun
hypernym: 01082290-n