commutation-n
type: LexicalEntry
canonical form: commutation
sense: 01168409-n
part of speech: noun

re-sentencing-n
type: LexicalEntry
canonical form: re-sentencing
sense: 01168409-n
part of speech: noun

01168409-n
type: LexicalConcept
in scheme: en-word.net
definition: (law) the reduction in severity of a punishment imposed by law
ili: i41509
lexfile: noun.act
part of speech: noun
domain topic: 08458195-n
hypernym: 01073335-n