use-v
type: LexicalEntry
canonical form: use
sense: 01167359-v
part of speech: verb

habituate-v
type: LexicalEntry
canonical form: habituate
sense: 01167359-v
part of speech: verb

01167359-v
type: LexicalConcept
in scheme: en-word.net
definition: take or consume (regularly or habitually)
example: She uses drugs rarely
ili: i27444
lexfile: verb.consumption
part of speech: verb
hypernym: 01159300-v