levy-n
type: LexicalEntry
canonical form: levy
sense: 01160551-n
part of speech: noun

levy en masse-n
type: LexicalEntry
canonical form: levy en masse
sense: 01160551-n
part of speech: noun

01160551-n
type: LexicalConcept
in scheme: en-word.net
definition: the act of drafting into military service
ili: i41470
lexfile: noun.act
part of speech: noun
hypernym: 01160337-n