raise-v
type: LexicalEntry
canonical form: raise
sense: 01158872-v
part of speech: verb

01158872-v
type: LexicalConcept
in scheme: en-word.net
definition: bid (one's partner's suit) at a higher level
ili: i27407
lexfile: verb.competition
part of speech: verb
domain topic: 00491580-n
hypernym: 02305021-v