federation-n
type: LexicalEntry
canonical form: federation
sense: 01155800-n
part of speech: noun

01155800-n
type: LexicalConcept
in scheme: en-word.net
definition: the act of constituting a political unity out of a number of separate states or colonies or provinces so that each member retains the management of its internal affairs
ili: i41446
lexfile: noun.act
part of speech: noun
hypernym: 00237945-n