tackle-v
type: LexicalEntry
canonical form: tackle
sense: 01152630-v
part of speech: verb

01152630-v
type: LexicalConcept
in scheme: en-word.net
definition: seize and throw down an opponent player, who usually carries the ball
ili: i27375
lexfile: verb.competition
part of speech: verb
domain topic: 00469555-n
hypernym: 01120867-v