restriction-n
type: LexicalEntry
canonical form: restriction
sense: 01151109-n
part of speech: noun

confinement-n
type: LexicalEntry
canonical form: confinement
sense: 01151109-n
part of speech: noun

01151109-n
type: LexicalConcept
in scheme: en-word.net
definition: the act of keeping something within specified bounds (by force if necessary)
example: the restriction of the infection to a focal area
ili: i41422
lexfile: noun.act
part of speech: noun
hypernym: 01147872-n