spoiled-a
type: LexicalEntry
canonical form: spoiled
sense: 01142402-s
part of speech: adjective

spoilt-a
type: LexicalEntry
canonical form: spoilt
sense: 01142402-s
part of speech: adjective

01142402-s
type: LexicalConcept
in scheme: en-word.net
definition: having the character or disposition harmed by pampering or oversolicitous attention
example: a spoiled child
ili: i6230
lexfile: adj.all
part of speech: adjective satellite
similar: https://en-word.net/synset/01138269-a