guard-v
type: LexicalEntry
canonical form: guard
sense: 01131763-v
part of speech: verb

ward-v
type: LexicalEntry
canonical form: ward
sense: 01131763-v
part of speech: verb

01131763-v
type: LexicalConcept
in scheme: en-word.net
definition: watch over or shield from danger or harm; protect
example: guard my possessions while I'm away
ili: i27249
lexfile: verb.competition
part of speech: verb
hypernym: 01130619-v