cultivation-n
type: LexicalEntry
canonical form: cultivation
sense: 01131684-n
part of speech: noun

01131684-n
type: LexicalConcept
in scheme: en-word.net
definition: socialization through training and education to develop one's mind or manners
example: her cultivation was remarkable
ili: i41321
lexfile: noun.act
part of speech: noun
hypernym: 01131305-n