coercion-n
type: LexicalEntry
canonical form: coercion
sense: 01129566-n
part of speech: noun

01129566-n
type: LexicalConcept
in scheme: en-word.net
definition: the act of compelling by force of authority
ili: i41310
lexfile: noun.act
part of speech: noun
hypernym: 01129340-n