venture-n
type: LexicalEntry
canonical form: venture
sense: 01119485-n
part of speech: noun

01119485-n
type: LexicalConcept
in scheme: en-word.net
definition: a commercial undertaking that risks a loss but promises a profit
ili: i41255
lexfile: noun.act
part of speech: noun
hypernym: 01096649-n