test-v
type: LexicalEntry
canonical form: test
sense: 01115009-v
part of speech: verb

01115009-v
type: LexicalConcept
in scheme: en-word.net
definition: achieve a certain score or rating on a test
example: She tested high on the LSAT and was admitted to all the good law schools
ili: i27158
lexfile: verb.competition
part of speech: verb
hypernym: 01114789-v
similar: 00671888-v