unique-a
type: LexicalEntry
canonical form: unique
sense: 01108735-s
part of speech: adjective

01108735-s
type: LexicalConcept
in scheme: en-word.net
definition: (followed by ‘to’) applying exclusively to a given category or condition or locality
example: a species unique to Australia
ili: i6075
lexfile: adj.all
part of speech: adjective satellite
similar: https://en-word.net/synset/01106714-a