typography-n
type: LexicalEntry
canonical form: typography
sense: 01104905-n
part of speech: noun

01104905-n
type: LexicalConcept
in scheme: en-word.net
definition: the craft of composing type and printing from it
ili: i41178
lexfile: noun.act
part of speech: noun
hypernym: 00607485-n