serve-v
type: LexicalEntry
canonical form: serve
sense: 01097629-v
part of speech: verb

01097629-v
type: LexicalConcept
in scheme: en-word.net
definition: do duty or hold offices; serve in a specific function
example: He served as head of the department for three years
example: She served in Congress for two terms
ili: i27069
lexfile: verb.competition
part of speech: verb
hypernym: 02415985-v
similar: 02416751-v