campaign-v
type: LexicalEntry
canonical form: campaign
sense: 01096497-v
part of speech: verb

run-v
type: LexicalEntry
canonical form: run
sense: 01096497-v
part of speech: verb

01096497-v
type: LexicalConcept
in scheme: en-word.net
definition: run, stand, or compete for an office or a position
example: Who's running for treasurer this year?
ili: i27063
lexfile: verb.competition
part of speech: verb
hypernym: 01088514-v